Image GUID (IPTC Photo Metadata)
type: Concept
definition: Globally Unique Identifier of an image as specified by the IPTC Photo Metadata
in scheme: altidrole
created: 2017-12-04T12:00:00+00:00
modified: 2017-12-04T12:00:00+00:00