Value of a Sport Facet
type: ConceptScheme
pref scheme alias: aspfacetvalue
authority: http://www.iptc.org
rights holder: IPTC, International Press Telecommunications Council - https://iptc.org
licence link: http://creativecommons.org/licenses/by/4.0/
date released: 2019-11-25T12:00:00+00:00
date submitted: 2019-11-25T12:00:00+00:00
definition: A value which may be used with specific facet(s) of the Sport Facets NewsCodes - http://cv.iptc.org/newscodes/asportfacet/
has top concept: 14.1
has top concept: 470
has top concept: 49er
has top concept: 505
has top concept: 8-ball
has top concept: 9-ball
has top concept: accuracy
has top concept: aerials
has top concept: air pistol
has top concept: air rifle
has top concept: around the world
has top concept: artistic skiing
has top concept: backstroke
has top concept: ball
has top concept: bare hand
has top concept: beam
has top concept: bi-crossing
has top concept: breaststroke
has top concept: butterfly
has top concept: canoe sailing
has top concept: chistera ancha
has top concept: chistera corta
has top concept: classic
has top concept: clean and jerk
has top concept: clubs
has top concept: combined
has top concept: coxless
has top concept: cross country
has top concept: cross-country
has top concept: cyclo-cross
has top concept: DDC
has top concept: discathon
has top concept: disc golf
has top concept: distance
has top concept: double trap
has top concept: downhill
has top concept: dressage
has top concept: endurance
has top concept: enduro
has top concept: epee
has top concept: europe
has top concept: eventing
has top concept: F3000
has top concept: finn
has top concept: flatland
has top concept: flat racing
has top concept: floor exercise
has top concept: flying dutchman
has top concept: foil
has top concept: folkrace
has top concept: formula one
has top concept: freestyle
has top concept: fronton
has top concept: futsal
has top concept: giant slalom
has top concept: grand prix
has top concept: grass track
has top concept: guts
has top concept: harness racing
has top concept: hoop
has top concept: horizontal bar
has top concept: horse driving
has top concept: ice dance
has top concept: beach football
has top concept: indoor soccer

14.1
type: Concept
definition: A player nominates the ball he is attempting to pot and into which pocket. He collects points for each successful hit. He continues until he makes a mistake. Before hitting the 15th ball, the 14 reds are set up again in the triangle.
in scheme: Value of a Sport Facet
created: 2017-07-04T12:00:00+00:00
modified: 2017-07-04T12:00:00+00:00
is object of: billiardtype

470
type: Concept
definition: Boat Category: two man dinghy (7.10m/sq mainsail) Olympic sport
in scheme: Value of a Sport Facet
created: 2017-07-04T12:00:00+00:00
modified: 2017-07-04T12:00:00+00:00
is object of: sailingtype

49er
type: Concept
definition: Boat Category: two man dinghy (8.23m/sq mainsail) Olympic sport
in scheme: Value of a Sport Facet
created: 2017-07-04T12:00:00+00:00
modified: 2017-07-04T12:00:00+00:00
is object of: sailingtype

505
type: Concept
definition: Boat Category: two man dinghy
in scheme: Value of a Sport Facet
created: 2017-07-04T12:00:00+00:00
modified: 2017-07-04T12:00:00+00:00
is object of: sailingtype

8-ball
type: Concept
definition: A game using 15 balls and a white. The first player aims to pot the balls numbered 1-7 (solids) with the second player potting balls 9-15 (stripes). After that the first player to pot the black wins.
in scheme: Value of a Sport Facet
created: 2017-07-04T12:00:00+00:00
modified: 2017-07-04T12:00:00+00:00
is object of: billiardtype

9-ball
type: Concept
definition: A game played with nine balls numbered 1-9, and a white. On each turn the player must hit the lowest numbered ball.
in scheme: Value of a Sport Facet
created: 2017-07-04T12:00:00+00:00
modified: 2017-07-04T12:00:00+00:00
is object of: billiardtype

accuracy
type: Concept
definition: Each player has 28 throws from various distances and angles to throw the disc through a goal 1.5 x 1.5 meters.
in scheme: Value of a Sport Facet
created: 2017-07-04T12:00:00+00:00
modified: 2017-07-04T12:00:00+00:00
is object of: flyingdisctype

aerials
type: Concept
definition: Competitors perform a series of aerial twists and turns from a prepared jump.
in scheme: Value of a Sport Facet
created: 2017-07-04T12:00:00+00:00
modified: 2017-07-04T12:00:00+00:00
is object of: freestyleskiingtype

air pistol
type: Concept
definition: Shooting event shot with 4.5 mm (or .177) caliber air guns at a distance of 10 metres (11 yards)
in scheme: Value of a Sport Facet
created: 2017-07-04T12:00:00+00:00
modified: 2017-07-04T12:00:00+00:00
is object of: shootingtype

air rifle
type: Concept
definition: Shooting event shot over a distance of 10 metres (10.94 yards) from a standing position with a 4.5 mm (0.177 in) calibre air rifle with a maximum weight of 5.5 kg (12.13 lb).
in scheme: Value of a Sport Facet
created: 2017-07-04T12:00:00+00:00
modified: 2017-07-04T12:00:00+00:00
is object of: shootingtype

around the world
type: Concept
definition: Race category: open seas racing
in scheme: Value of a Sport Facet
created: 2017-07-04T12:00:00+00:00
modified: 2017-07-04T12:00:00+00:00
is object of: sailingtype

artistic skiing
type: Concept
definition: Competitors perform a series of artistic moves (jumps and twists) all set to music. The use of ski poles is permitted.
in scheme: Value of a Sport Facet
created: 2017-07-04T12:00:00+00:00
modified: 2017-07-04T12:00:00+00:00
is object of: freestyleskiingtype

backstroke
type: Concept
definition: Swimming style, on the back, legs move in flapping motion whilst arms propel the swimmer forward.
in scheme: Value of a Sport Facet
created: 2017-07-04T12:00:00+00:00
modified: 2017-07-04T12:00:00+00:00
is object of: swimmingtype

ball
type: Concept
definition: Rhythmic gymnastics event using rubber or plastic ball that is 18 to 20 cm in diameter and having a minimum weight of 400g
in scheme: Value of a Sport Facet
created: 2017-07-04T12:00:00+00:00
modified: 2017-07-04T12:00:00+00:00
is object of: rhythmgymtype

bare hand
type: Concept
definition: The *Main Nue* (bare hand) is the ancestor of all Basque sports.
in scheme: Value of a Sport Facet
created: 2017-07-04T12:00:00+00:00
modified: 2017-07-04T12:00:00+00:00
is object of: jaialaitype

beam
type: Concept
definition: Artistic gymnastics event where gymnasts perform leaps and flips from a balance beam that is 10 cm wide.
in scheme: Value of a Sport Facet
created: 2017-07-04T12:00:00+00:00
modified: 2017-07-04T12:00:00+00:00
is object of: artisticgymtype

bi-crossing
type: Concept
definition: Cycling race where competitors have to cover a circuit with obstacles as quickly as possible.
in scheme: Value of a Sport Facet
created: 2017-07-04T12:00:00+00:00
modified: 2017-07-04T12:00:00+00:00
is object of: cyclingtype

breaststroke
type: Concept
definition: Swimming style, on the front, effecting forward and outward push movements with the arms and backward and outward pushes with the legs.
in scheme: Value of a Sport Facet
created: 2017-07-04T12:00:00+00:00
modified: 2017-07-04T12:00:00+00:00
is object of: swimmingtype

butterfly
type: Concept
definition: Swimming style, swum on the front with the shoulders remaining parallel to the water both arms moving in simultaneous windmill fashion, the legs remain together and are moved in a flapping motion.
in scheme: Value of a Sport Facet
created: 2017-07-04T12:00:00+00:00
modified: 2017-07-04T12:00:00+00:00
is object of: swimmingtype

canoe sailing
type: Concept
definition: A race involving a canoe equipped with a sail.
in scheme: Value of a Sport Facet
created: 2017-07-04T12:00:00+00:00
modified: 2017-07-04T12:00:00+00:00
is object of: canoekayaktype

chistera ancha
type: Concept
definition: The *chistera-ancha* also called the *cesta punta* is the game played in a *jaï alai* with 1 or 2 players in each team. The players use a long curved basket called the *chistera* (68 cm long and 13 cm wide).
in scheme: Value of a Sport Facet
created: 2017-07-04T12:00:00+00:00
modified: 2017-07-04T12:00:00+00:00
is object of: jaialaitype

chistera corta
type: Concept
definition: The *chistera-corta* is the game played in a fronton *place libre* with left hand wall and 3 players in each team. The players use a long curved basket called the *chistera* (56 cm long and 12 cm wide).
in scheme: Value of a Sport Facet
created: 2017-07-04T12:00:00+00:00
modified: 2017-07-04T12:00:00+00:00
is object of: jaialaitype

classic
type: Concept
definition: The basic method of propulsion over undulating terrain, by using a striding action, with extra momentum provided by pushing with the poles diagonally opposite to the skis.
note: Moved from *nordicskiingtype* to *crosscountryskiingtype* in August 2019
in scheme: Value of a Sport Facet
created: 2017-07-04T12:00:00+00:00
modified: 2017-07-04T12:00:00+00:00
is object of: crosscountryskiingtype

clean and jerk
type: Concept
definition: The bar is first lifted to the shoulders and then jerk it above the head and keep it there while maintaining straight legs
in scheme: Value of a Sport Facet
created: 2017-07-04T12:00:00+00:00
modified: 2017-07-04T12:00:00+00:00
is object of: weightliftingtype

clubs
type: Concept
definition: Rhythmic gymnastics event where clubs are passed and tossed
in scheme: Value of a Sport Facet
created: 2017-07-04T12:00:00+00:00
modified: 2017-07-04T12:00:00+00:00
is object of: rhythmgymtype

combined
type: Concept
definition: Race, usually competed over two days that combines a downhill leg and a slalom leg rewarding the most complete skiers. Combined fastest time wins.
in scheme: Value of a Sport Facet
created: 2017-07-04T12:00:00+00:00
modified: 2017-07-04T12:00:00+00:00
is object of: alpineskiingtype

combined
type: Concept
definition: Competition combining cross-country skiing and ski jumping
note: Moved from *nordicskiingtype* to *crosscountryskiingtype* in August 2019
in scheme: Value of a Sport Facet
created: 2017-07-04T12:00:00+00:00
modified: 2017-07-04T12:00:00+00:00
is object of: crosscountryskiingtype

combined
type: Concept
definition: A combined event made up of the slalom, jump and trick
in scheme: Value of a Sport Facet
created: 2017-07-04T12:00:00+00:00
modified: 2017-07-04T12:00:00+00:00
is object of: waterskiingtype

coxless
type: Concept
definition: one oar each and without a team mate to give directions
in scheme: Value of a Sport Facet
created: 2017-07-04T12:00:00+00:00
modified: 2017-07-04T12:00:00+00:00
is object of: rowingtype

cross country
type: Concept
definition: Equestrian event held on a designated circuit in the countryside featuring artificial and natural obstacles.
in scheme: Value of a Sport Facet
created: 2017-07-04T12:00:00+00:00
modified: 2017-07-04T12:00:00+00:00
is object of: equestriantype

cross-country
type: Concept
definition: A race over natural terrain.
in scheme: Value of a Sport Facet
created: 2017-07-04T12:00:00+00:00
modified: 2017-07-04T12:00:00+00:00
is object of: racetype

cyclo-cross
type: Concept
definition: A cycling race staged on various surfaces - earth, grass, sand or tarmac.
in scheme: Value of a Sport Facet
created: 2017-07-04T12:00:00+00:00
modified: 2017-07-04T12:00:00+00:00
is object of: cyclingtype

DDC
type: Concept
definition: Abbreviation for Double Disc Court. Two players per team in a square 13x13 metre. The teams start with one disc per team and throw at each other. Discs are thrown back and forth until one or both hit the ground.
in scheme: Value of a Sport Facet
created: 2017-07-04T12:00:00+00:00
modified: 2017-07-04T12:00:00+00:00
is object of: flyingdisctype

discathon
type: Concept
definition: The object is to throw and run a park course of about 1 kilometre. Four players compete in each heat. They have two discs each. They may also carry a third disc in reserve. Where one thrown disc stops the second disc must be thrown.
in scheme: Value of a Sport Facet
created: 2017-07-04T12:00:00+00:00
modified: 2017-07-04T12:00:00+00:00
is object of: flyingdisctype

disc golf
type: Concept
definition: Much like golf but played with discs instead of balls and clubs. Instead of a hole in the ground there is a metal basket with light metal chains to throw the disc at. Players often carry discs specialized for long throws, right or left bends.
in scheme: Value of a Sport Facet
created: 2017-07-04T12:00:00+00:00
modified: 2017-07-04T12:00:00+00:00
is object of: flyingdisctype

distance
type: Concept
definition: The object is to throw the disc as far as possible. Each player get five throws per turn. Throws are made downwind.
in scheme: Value of a Sport Facet
created: 2017-07-04T12:00:00+00:00
modified: 2017-07-04T12:00:00+00:00
is object of: flyingdisctype

double trap
type: Concept
definition: Shooting event with two moving targets launched at the same time
in scheme: Value of a Sport Facet
created: 2017-07-04T12:00:00+00:00
modified: 2017-07-04T12:00:00+00:00
is object of: shootingtype

downhill
type: Concept
definition: Alpine skiing high speed race between widely set gates.
in scheme: Value of a Sport Facet
created: 2017-07-04T12:00:00+00:00
modified: 2017-07-04T12:00:00+00:00
is object of: alpineskiingtype

dressage
type: Concept
definition: A rider is judged on a series of moves at three different paces - walk, trot and gallop.
in scheme: Value of a Sport Facet
created: 2017-07-04T12:00:00+00:00
modified: 2017-07-04T12:00:00+00:00
is object of: equestriantype

endurance
type: Concept
definition: Equestrian sport consisting of controlled long-distance races.
in scheme: Value of a Sport Facet
created: 2017-07-04T12:00:00+00:00
modified: 2017-07-04T12:00:00+00:00
is object of: equestriantype

endurance
type: Concept
definition: Motorcycle road race where consistency and endurance is the object.
in scheme: Value of a Sport Facet
created: 2017-07-04T12:00:00+00:00
modified: 2017-07-04T12:00:00+00:00
is object of: motorcyclingtype

endurance
type: Concept
definition: Endurance races for a driver and co-pilot using specially built cars.
in scheme: Value of a Sport Facet
created: 2017-07-04T12:00:00+00:00
modified: 2017-07-04T12:00:00+00:00
is object of: motorcarracingtype

enduro
type: Concept
definition: Motrocycle race of speed, endurance and regularity over varied surfaces such as through forests and on dirt tracks.
in scheme: Value of a Sport Facet
created: 2017-07-04T12:00:00+00:00
modified: 2017-07-04T12:00:00+00:00
is object of: motorcyclingtype

epee
type: Concept
definition: Category of fencing using a weapon with a triangular cross-section blade and a large bell guard.
in scheme: Value of a Sport Facet
created: 2017-07-04T12:00:00+00:00
modified: 2017-07-04T12:00:00+00:00
is object of: fencingtype

europe
type: Concept
definition: Boat Category: one man dinghy (4.57m/sq mainsail) Olympic sport
in scheme: Value of a Sport Facet
created: 2017-07-04T12:00:00+00:00
modified: 2017-07-04T12:00:00+00:00
is object of: sailingtype

eventing
type: Concept
definition: Equestrian event involving three disciplines - Dressage, cross-country and show jumping.
in scheme: Value of a Sport Facet
created: 2017-07-04T12:00:00+00:00
modified: 2017-07-04T12:00:00+00:00
is object of: equestriantype

F3000
type: Concept
definition: Using less powerful motors than the Formula One, designated construction teams race over varied circuits the world over in speed races for individual and team honours over a season.
in scheme: Value of a Sport Facet
created: 2017-07-04T12:00:00+00:00
modified: 2017-07-04T12:00:00+00:00
is object of: motorcarracingtype

finn
type: Concept
definition: Boat Category: one man dinghy (10m/sq mainsail) Olympic sport
in scheme: Value of a Sport Facet
created: 2017-07-04T12:00:00+00:00
modified: 2017-07-04T12:00:00+00:00
is object of: sailingtype

flatland
type: Concept
definition: BMX on a smooth, flat surface. Tricks involve spinning and balancing in a variety of body and bicycle positions.
in scheme: Value of a Sport Facet
created: 2017-07-04T12:00:00+00:00
modified: 2017-07-04T12:00:00+00:00
is object of: bmxfreestyletype

flat racing
type: Concept
definition: Horse race run on a level racecourse.
in scheme: Value of a Sport Facet
created: 2017-07-04T12:00:00+00:00
modified: 2017-07-04T12:00:00+00:00
is object of: horseracingtype

floor exercise
type: Concept
definition: Artistic gymnastics event where floor exercises are performed on a 12m/sq matt.
in scheme: Value of a Sport Facet
created: 2017-07-04T12:00:00+00:00
modified: 2017-07-04T12:00:00+00:00
is object of: artisticgymtype

flying dutchman
type: Concept
definition: Boat Category: two man dinghy
in scheme: Value of a Sport Facet
created: 2017-07-04T12:00:00+00:00
modified: 2017-07-04T12:00:00+00:00
is object of: sailingtype

foil
type: Concept
definition: Category of fencing using a weapon with a rectangular cross-section blade and a small bell guard.
in scheme: Value of a Sport Facet
created: 2017-07-04T12:00:00+00:00
modified: 2017-07-04T12:00:00+00:00
is object of: fencingtype

folkrace
type: Concept
in scheme: Value of a Sport Facet
created: 2019-11-25T12:00:00+00:00
modified: 2019-11-25T12:00:00+00:00
is object of: motorcarracingtype

formula one
type: Concept
definition: Single cockpit car racing where 20 or so competitors race head to head over varied circuits around the world to win Grand Prix points in an individual and constructors championship
in scheme: Value of a Sport Facet
created: 2017-07-04T12:00:00+00:00
modified: 2017-07-04T12:00:00+00:00
is object of: motorcarracingtype

freestyle
type: Concept
definition: A judged event where groups of two or three players perform as many tricks as possible. In competitions the judges can use either a ranking system or set scores on presentation, execution and difficulty.
in scheme: Value of a Sport Facet
created: 2017-07-04T12:00:00+00:00
modified: 2017-07-04T12:00:00+00:00
is object of: flyingdisctype

freestyle
type: Concept
definition: Any swimming style may be employed, though front crawl is universally employed.
in scheme: Value of a Sport Facet
created: 2017-07-04T12:00:00+00:00
modified: 2017-07-04T12:00:00+00:00
is object of: swimmingtype

fronton
type: Concept
definition: The *fronton* known as *Fronton Place Libre* consists of a rectangular outdoor court plus a large pink shaped wall at one end. The two sides and the other end are left opened.
in scheme: Value of a Sport Facet
created: 2017-07-04T12:00:00+00:00
modified: 2017-07-04T12:00:00+00:00
is object of: jaialaitype

futsal
type: Concept
in scheme: Value of a Sport Facet
created: 2019-11-25T12:00:00+00:00
modified: 2019-11-25T12:00:00+00:00
is object of: soccertype

giant slalom
type: Concept
definition: Timed race between poles or gates. Total time in two heats.
in scheme: Value of a Sport Facet
created: 2017-07-04T12:00:00+00:00
modified: 2017-07-04T12:00:00+00:00
is object of: alpineskiingtype

giant slalom
type: Concept
definition: Race between poles or gates, longer and wider than slalom.
in scheme: Value of a Sport Facet
created: 2017-07-04T12:00:00+00:00
modified: 2017-07-04T12:00:00+00:00
is object of: snowboardingtype

grand prix
type: Concept
definition: A race with Grand Prix motorcycles
in scheme: Value of a Sport Facet
created: 2017-07-04T12:00:00+00:00
modified: 2017-07-04T12:00:00+00:00
is object of: motorcyclingtype

grass track
type: Concept
definition: Horse race competed on turf.
in scheme: Value of a Sport Facet
created: 2017-07-04T12:00:00+00:00
modified: 2017-07-04T12:00:00+00:00
is object of: horseracingtype

guts
type: Concept
definition: Team game where two teams of 5 players each face each other. Teams take turns to throw the disc towards the other team. Points are scored if the opposing team does not catch the disc.
in scheme: Value of a Sport Facet
created: 2017-07-04T12:00:00+00:00
modified: 2017-07-04T12:00:00+00:00
is object of: flyingdisctype

harness racing
type: Concept
definition: Horses hitched to a jockeyed buggy race round a flat course. Can be performed at a trotting gait or a pacing gait.
in scheme: Value of a Sport Facet
created: 2017-07-04T12:00:00+00:00
modified: 2017-07-04T12:00:00+00:00
is object of: horseracingtype

hoop
type: Concept
definition: Rhythmic gymnastics event where a hoop is rolled and thrown
in scheme: Value of a Sport Facet
created: 2017-07-04T12:00:00+00:00
modified: 2017-07-04T12:00:00+00:00
is object of: rhythmgymtype

horizontal bar
type: Concept
definition: Artistic gymnastics event where gymnasts turn, spin and perform pirouettes around the horizontal bar.
in scheme: Value of a Sport Facet
created: 2017-07-04T12:00:00+00:00
modified: 2017-07-04T12:00:00+00:00
is object of: artisticgymtype

horse driving
type: Concept
definition: Equestrian events involving horses being driven in harness, single vehicle around a course.
in scheme: Value of a Sport Facet
created: 2017-07-04T12:00:00+00:00
modified: 2017-07-04T12:00:00+00:00
is object of: equestriantype

ice dance
type: Concept
definition: Skating event that takes place over three days with, in order, two compulsory dances, the original dance (2min 30sec) and the free dance (4min)
in scheme: Value of a Sport Facet
created: 2017-07-04T12:00:00+00:00
modified: 2017-07-04T12:00:00+00:00
is object of: figureskatingtype

beach football
type: Concept
definition: A form of association football played on a soft-sand surface and a smaller pitch which allows for numerous goal attempts
in scheme: Value of a Sport Facet
created: 2019-11-25T12:00:00+00:00
modified: 2019-11-25T12:00:00+00:00
is object of: soccertype

indoor soccer
type: Concept
in scheme: Value of a Sport Facet
created: 2019-11-25T12:00:00+00:00
modified: 2019-11-25T12:00:00+00:00
is object of: soccertype

indy racing
type: Concept
definition: North American top range professional league speed racing over circuits.
in scheme: Value of a Sport Facet
created: 2017-07-04T12:00:00+00:00
modified: 2017-07-04T12:00:00+00:00
is object of: motorcarracingtype

jump
type: Concept
definition: Skiers perform as long a jump as possible from a ramp in the water
in scheme: Value of a Sport Facet
created: 2017-07-04T12:00:00+00:00
modified: 2017-07-04T12:00:00+00:00
is object of: waterskiingtype

jumping
type: Concept
definition: A rider and horse attempt to jump a series of obstacles in an enclosed arena against the clock.
in scheme: Value of a Sport Facet
created: 2017-07-04T12:00:00+00:00
modified: 2017-07-04T12:00:00+00:00
is object of: equestriantype

kart racing
type: Concept
in scheme: Value of a Sport Facet
created: 2019-11-25T12:00:00+00:00
modified: 2019-11-25T12:00:00+00:00
is object of: motorcarracingtype

keirin
type: Concept
definition: Sprint between six cyclists where a pacemaker on a moped gradually increases the pace over the first 1400m. When the pacemaker leaves the track the race develops into a sprint finish over the final 6-700m.
in scheme: Value of a Sport Facet
created: 2017-07-04T12:00:00+00:00
modified: 2017-07-04T12:00:00+00:00
is object of: cyclingtype

lake
type: Concept
definition: Windsurfing races on a lake.
in scheme: Value of a Sport Facet
created: 2017-07-04T12:00:00+00:00
modified: 2017-07-04T12:00:00+00:00
is object of: windsurfingtype

land
type: Concept
definition: Windsurfing races competed on land with a board equipped with wheels.
in scheme: Value of a Sport Facet
created: 2017-07-04T12:00:00+00:00
modified: 2017-07-04T12:00:00+00:00
is object of: windsurfingtype

laser
type: Concept
definition: Boat Category: one man dinghy (4.6m/sq mainsail) Olympic sport
in scheme: Value of a Sport Facet
created: 2017-07-04T12:00:00+00:00
modified: 2017-07-04T12:00:00+00:00
is object of: sailingtype

left wall
type: Concept
definition: A *fronton with left hand wall* is an indoor fronton with a 36 meters long court where Pala or Main Nue are played. Three walls are used in the game: the front, the back and the left hand wall.
in scheme: Value of a Sport Facet
created: 2017-07-04T12:00:00+00:00
modified: 2017-07-04T12:00:00+00:00
is object of: jaialaitype

lightweight
type: Concept
definition: Where a weight category is imposed on competitors
in scheme: Value of a Sport Facet
created: 2017-07-04T12:00:00+00:00
modified: 2017-07-04T12:00:00+00:00
is object of: rowingtype

madison race
type: Concept
definition: A points race by teams comprising two cyclists in relay-format.
in scheme: Value of a Sport Facet
created: 2017-07-04T12:00:00+00:00
modified: 2017-07-04T12:00:00+00:00
is object of: cyclingtype

marathon
type: Concept
definition: Long distance open water swimming.
in scheme: Value of a Sport Facet
created: 2017-07-04T12:00:00+00:00
modified: 2017-07-04T12:00:00+00:00
is object of: swimmingtype

mass start
type: Concept
definition: Event where all competitors start at once.
in scheme: Value of a Sport Facet
created: 2017-07-04T12:00:00+00:00
modified: 2017-07-04T12:00:00+00:00
is object of: racetype

medley
type: Concept
definition: A combination of four different swimming styles in one race.
in scheme: Value of a Sport Facet
created: 2017-07-04T12:00:00+00:00
modified: 2017-07-04T12:00:00+00:00
is object of: swimmingtype

men
type: Concept
definition: Single male human person
in scheme: Value of a Sport Facet
created: 2017-07-04T12:00:00+00:00
modified: 2017-07-04T12:00:00+00:00
is object of: gender

mistral
type: Concept
definition: Olympic boat class. A staged race using boats of the mistral type, which are 4.24 metres (13ft 11in) long and 1.3 metres (4ft 3in) wide. The number of races and the length of the courses varies.
in scheme: Value of a Sport Facet
created: 2017-07-04T12:00:00+00:00
modified: 2017-07-04T12:00:00+00:00
is object of: sailingtype

mixed
type: Concept
definition: Mixed team of male and female human persons
in scheme: Value of a Sport Facet
created: 2017-07-04T12:00:00+00:00
modified: 2017-07-04T12:00:00+00:00
is object of: gender

moguls
type: Concept
definition: Contestants attack a heavily moguled slope, performing technically challenging turns and jumps, while maintaining the most direct line from the top to the bottom of the hill.
in scheme: Value of a Sport Facet
created: 2017-07-04T12:00:00+00:00
modified: 2017-07-04T12:00:00+00:00
is object of: freestyleskiingtype

monohull
type: Concept
definition: Single hull craft
in scheme: Value of a Sport Facet
created: 2017-07-04T12:00:00+00:00
modified: 2017-07-04T12:00:00+00:00
is object of: sailingtype

moto-ball
type: Concept
definition: Team sport where drivers play a ball.
in scheme: Value of a Sport Facet
created: 2017-07-04T12:00:00+00:00
modified: 2017-07-04T12:00:00+00:00
is object of: motorcyclingtype

moto-cross
type: Concept
definition: Race over dirt tracks featuring severe mounds.
in scheme: Value of a Sport Facet
created: 2017-07-04T12:00:00+00:00
modified: 2017-07-04T12:00:00+00:00
is object of: motorcyclingtype

motoGP
type: Concept
definition: Races on Grand Prix motorcycles.
in scheme: Value of a Sport Facet
created: 2017-07-04T12:00:00+00:00
modified: 2017-07-04T12:00:00+00:00
is object of: motorcyclingtype

MTA
type: Concept
definition: In the MTA (Maximum Time Aloft) sub event the player throws a disc and then tries to catch the disc with one hand as late as possible before it hits the ground.
in scheme: Value of a Sport Facet
created: 2017-07-04T12:00:00+00:00
modified: 2017-07-04T12:00:00+00:00
is object of: flyingdisctype

multihulls
type: Concept
definition: Multi hull craft
in scheme: Value of a Sport Facet
created: 2017-07-04T12:00:00+00:00
modified: 2017-07-04T12:00:00+00:00
is object of: sailingtype

ocean
type: Concept
definition: Windsurfing races on the open seas.
in scheme: Value of a Sport Facet
created: 2017-07-04T12:00:00+00:00
modified: 2017-07-04T12:00:00+00:00
is object of: windsurfingtype

oval track
type: Concept
definition: Dog race where dogs pursue an artificial rabbit around an oval track .
in scheme: Value of a Sport Facet
created: 2017-07-04T12:00:00+00:00
modified: 2017-07-04T12:00:00+00:00
is object of: dogracingtype

overall
type: Concept
definition: Not an event in itself but in most competitions with individual events the winner of the competition will be awarded to the player with the highest combined score in the events.
in scheme: Value of a Sport Facet
created: 2017-07-04T12:00:00+00:00
modified: 2017-07-04T12:00:00+00:00
is object of: flyingdisctype

pairs
type: Concept
definition: Skating event where the pairs event comprises a short program which counts for 33.3% of the score, and the free skate which is worth 66.7%.
in scheme: Value of a Sport Facet
created: 2017-07-04T12:00:00+00:00
modified: 2017-07-04T12:00:00+00:00
is object of: figureskatingtype

pala-ancha
type: Concept
definition: The *pala-ancha* is the game played in a fronton *place libre* with 2 players in each team. The players use a heavy wooden bat *the pala* (50 cm long and 20 cm wide).
in scheme: Value of a Sport Facet
created: 2017-07-04T12:00:00+00:00
modified: 2017-07-04T12:00:00+00:00
is object of: jaialaitype

pala-corta
type: Concept
definition: The *pala-corta* is the game played in a fronton with left hand wall and 2 players in each team. The players use a heavy wooden bat the *pala-corta* (50 cm long and 10 cm wide).
in scheme: Value of a Sport Facet
created: 2017-07-04T12:00:00+00:00
modified: 2017-07-04T12:00:00+00:00
is object of: jaialaitype

parallel bars
type: Concept
definition: Artistic gymnastics event where gymnasts swing and turn around the parallel bars.
in scheme: Value of a Sport Facet
created: 2017-07-04T12:00:00+00:00
modified: 2017-07-04T12:00:00+00:00
is object of: artisticgymtype

parallel slalom
type: Concept
definition: Race between narrow set poles or gates run by two persons in parallel.
in scheme: Value of a Sport Facet
created: 2017-07-04T12:00:00+00:00
modified: 2017-07-04T12:00:00+00:00
is object of: alpineskiingtype

parallel slalom
type: Concept
definition: Race between narrow set poles or gates run by two persons in parallel
in scheme: Value of a Sport Facet
created: 2017-07-04T12:00:00+00:00
modified: 2017-07-04T12:00:00+00:00
is object of: snowboardingtype

park
type: Concept
definition: BMX with an emphasis on riding bowl transitions or ramp jumps.
in scheme: Value of a Sport Facet
created: 2017-07-04T12:00:00+00:00
modified: 2017-07-04T12:00:00+00:00
is object of: bmxfreestyletype

pasaka
type: Concept
definition: The *pasaka* is the name of the game played in a trinquet by teams of 2 players facing each other on each side of a net where the pelota is hit between opponents.
in scheme: Value of a Sport Facet
created: 2017-07-04T12:00:00+00:00
modified: 2017-07-04T12:00:00+00:00
is object of: jaialaitype

pistol
type: Concept
definition: Shooting event shot with a .22-caliber sport pistol, all firing must be done with one hand, unsupported.
in scheme: Value of a Sport Facet
created: 2017-07-04T12:00:00+00:00
modified: 2017-07-04T12:00:00+00:00
is object of: shootingtype

points race
type: Concept
definition: Cyclists aim to complete the highest number of laps. Bonus points are picked up in intermediate sprints held every 2500m.
in scheme: Value of a Sport Facet
created: 2017-07-04T12:00:00+00:00
modified: 2017-07-04T12:00:00+00:00
is object of: cyclingtype

pommel horse
type: Concept
definition: Artistic gymnastics event where gymnasts perform an uninterrupted swing motion over a handled horse using balance and strength.
in scheme: Value of a Sport Facet
created: 2017-07-04T12:00:00+00:00
modified: 2017-07-04T12:00:00+00:00
is object of: artisticgymtype

pontoniering
type: Concept
definition: Team sport, military tradition, similar to canoe regatta, in boat.
in scheme: Value of a Sport Facet
created: 2017-07-04T12:00:00+00:00
modified: 2017-07-04T12:00:00+00:00
is object of: canoekayaktype

powerlifting
type: Concept
definition: A strength test where competitors lift as heavy a weight as possible
in scheme: Value of a Sport Facet
created: 2017-07-04T12:00:00+00:00
modified: 2017-07-04T12:00:00+00:00
is object of: weightliftingtype

pursuit
type: Concept
definition: A race where the competitors start in relation to some previous result. Best competitor start first and then the rest in pursuit at some interval later.
in scheme: Value of a Sport Facet
created: 2017-07-04T12:00:00+00:00
modified: 2017-07-04T12:00:00+00:00
is object of: racetype

rallycross
type: Concept
definition: Motor car races over dirt tracks
in scheme: Value of a Sport Facet
created: 2017-07-04T12:00:00+00:00
modified: 2017-07-04T12:00:00+00:00
is object of: motorcarracingtype

rallying
type: Concept
definition: Motor car stage races.
in scheme: Value of a Sport Facet
created: 2017-07-04T12:00:00+00:00
modified: 2017-07-04T12:00:00+00:00
is object of: motorcarracingtype

rapid fire pistol
type: Concept
definition: Shooting event shot with a rapid fire pistol.
in scheme: Value of a Sport Facet
created: 2017-07-04T12:00:00+00:00
modified: 2017-07-04T12:00:00+00:00
is object of: shootingtype

rebot
type: Concept
definition: The *rebot* is the game played in a fronton *place libre* with 5 players in each team. They use a *chistera* (56 cm long and 12 cm large) or bare hands.
in scheme: Value of a Sport Facet
created: 2017-07-04T12:00:00+00:00
modified: 2017-07-04T12:00:00+00:00
is object of: jaialaitype

reining
type: Concept
definition: Competition where the riders guide the horses through a precise pattern of circles, spins, and stops.
in scheme: Value of a Sport Facet
created: 2017-07-04T12:00:00+00:00
modified: 2017-07-04T12:00:00+00:00
is object of: equestriantype

relay
type: Concept
definition: A race where the members of a team compete in parts of the race and the total time is counted.
in scheme: Value of a Sport Facet
created: 2017-07-04T12:00:00+00:00
modified: 2017-07-04T12:00:00+00:00
is object of: racetype

ribbon
type: Concept
definition: Rhythmic gymnastics event where a ribbon is used for moves that include flicks, circles, snakes and spirals, and throws
in scheme: Value of a Sport Facet
created: 2017-07-04T12:00:00+00:00
modified: 2017-07-04T12:00:00+00:00
is object of: rhythmgymtype

rifle 3 positions
type: Concept
definition: Shooting event consisting of the kneeling, prone, and standing positions, fired in that order, with 3×40 shots for men and 3×20 shots for women. The caliber is .22 Long Rifle (5.6 mm).
in scheme: Value of a Sport Facet
created: 2017-07-04T12:00:00+00:00
modified: 2017-07-04T12:00:00+00:00
is object of: shootingtype

rifle prone
type: Concept
definition: Shooting event consisting of 60 shots from the prone position with a .22 Long Rifle (5.6 mm) caliber rifle.
in scheme: Value of a Sport Facet
created: 2017-07-04T12:00:00+00:00
modified: 2017-07-04T12:00:00+00:00
is object of: shootingtype

rings
type: Concept
definition: Artistic gymnastics event where gymnasts perform feats of balance and strength from two suspended rings.
in scheme: Value of a Sport Facet
created: 2017-07-04T12:00:00+00:00
modified: 2017-07-04T12:00:00+00:00
is object of: artisticgymtype

river
type: Concept
definition: Windsurfing races on a river.
in scheme: Value of a Sport Facet
created: 2017-07-04T12:00:00+00:00
modified: 2017-07-04T12:00:00+00:00
is object of: windsurfingtype

road race
type: Concept
definition: Road race with all the competitor starting en masse.
in scheme: Value of a Sport Facet
created: 2017-07-04T12:00:00+00:00
modified: 2017-07-04T12:00:00+00:00
is object of: cyclingtype

rope
type: Concept
definition: Rhythmic gymnastics event where a rope is used for moves that include leaps and skipping
in scheme: Value of a Sport Facet
created: 2017-07-04T12:00:00+00:00
modified: 2017-07-04T12:00:00+00:00
is object of: rhythmgymtype

running target
type: Concept
definition: Shooting event where the target is pulled across a two meter wide aisle at the range of 10 metres from the firing point. The target is pulled at either of two speeds, slow or fast.
in scheme: Value of a Sport Facet
created: 2017-07-04T12:00:00+00:00
modified: 2017-07-04T12:00:00+00:00
is object of: shootingtype

sabre
type: Concept
definition: A fencing weapon with a flat blade and knuckle guard used with cutting or thrusting moves.
in scheme: Value of a Sport Facet
created: 2017-07-04T12:00:00+00:00
modified: 2017-07-04T12:00:00+00:00
is object of: fencingtype

SCF
type: Concept
definition: SCF (Self Caught Flights) combines by values the MTA (Maximum Time Aloft) and TRC (Throw Run Catch).
in scheme: Value of a Sport Facet
created: 2017-07-04T12:00:00+00:00
modified: 2017-07-04T12:00:00+00:00
is object of: flyingdisctype

sculls
type: Concept
definition: Two oars each and without a team mate to give directions
in scheme: Value of a Sport Facet
created: 2017-07-04T12:00:00+00:00
modified: 2017-07-04T12:00:00+00:00
is object of: rowingtype

short course
type: Concept
definition: Races competed in a 25m length pool.
in scheme: Value of a Sport Facet
created: 2017-07-04T12:00:00+00:00
modified: 2017-07-04T12:00:00+00:00
is object of: swimmingtype

side-cars
type: Concept
definition: Race using motorycles of different engine sizes with an attached side car featuring a passenger.
in scheme: Value of a Sport Facet
created: 2017-07-04T12:00:00+00:00
modified: 2017-07-04T12:00:00+00:00
is object of: motorcyclingtype

singles
type: Concept
definition: Skating event where the individual events comprise a short program which counts for 33.3% of the score, and the free skate which is worth 66.7%.
in scheme: Value of a Sport Facet
created: 2017-07-04T12:00:00+00:00
modified: 2017-07-04T12:00:00+00:00
is object of: figureskatingtype

skating/freestyle
type: Concept
definition: Skirace were the skier is allowed to skate. There are no prepared tracks in the snow for the skis. Poles are normally longer, boots sturdier and skis shorter compared to classic skiing.
note: Moved from *nordicskiingtype* to *crosscountryskiingtype* in August 2019
in scheme: Value of a Sport Facet
created: 2017-07-04T12:00:00+00:00
modified: 2017-07-04T12:00:00+00:00
is object of: crosscountryskiingtype

skeet
type: Concept
definition: Shooting event with moving targets, competitor shoots from a series of positions
in scheme: Value of a Sport Facet
created: 2017-07-04T12:00:00+00:00
modified: 2017-07-04T12:00:00+00:00
is object of: shootingtype

skiathlon
type: Concept
definition: Cross-country skiing race in two stages. The first stage is done in the classic technique. After the first stage, the racers change skis at a transition area, then continue racing on skating skis using the free technique.
note: Moved from *nordicskiingtype* to *crosscountryskiingtype* in August 2019
in scheme: Value of a Sport Facet
created: 2017-07-04T12:00:00+00:00
modified: 2017-07-04T12:00:00+00:00
is object of: crosscountryskiingtype

ski-cross
type: Concept
definition: a multi-participant downhill ski race on irregular terrain
in scheme: Value of a Sport Facet
created: 2019-11-22T12:00:00+00:00
modified: 2019-11-22T12:00:00+00:00
is object of: freestyleskiingtype

slalom
type: Concept
definition: Timed race between narrow set poles or gates. Total time in two heats.
in scheme: Value of a Sport Facet
created: 2017-07-04T12:00:00+00:00
modified: 2017-07-04T12:00:00+00:00
is object of: alpineskiingtype

slalom
type: Concept
definition: White water course set out with gates consisting of two poles suspended vertically over the water. Competitors must negotiate the gates or face penalties.
in scheme: Value of a Sport Facet
created: 2017-07-04T12:00:00+00:00
modified: 2017-07-04T12:00:00+00:00
is object of: canoekayaktype

slalom
type: Concept
definition: Race between narrow set poles or gates.
in scheme: Value of a Sport Facet
created: 2017-07-04T12:00:00+00:00
modified: 2017-07-04T12:00:00+00:00
is object of: snowboardingtype

slalom
type: Concept
definition: Speed event where contestants round a course marked out by buoys
in scheme: Value of a Sport Facet
created: 2017-07-04T12:00:00+00:00
modified: 2017-07-04T12:00:00+00:00
is object of: waterskiingtype

sled
type: Concept
definition: Dog race where dogs are harnessed to a sled.
in scheme: Value of a Sport Facet
created: 2017-07-04T12:00:00+00:00
modified: 2017-07-04T12:00:00+00:00
is object of: dogracingtype

snatch
type: Concept
definition: The bar must be lifted from floor to above the head in one movement
in scheme: Value of a Sport Facet
created: 2017-07-04T12:00:00+00:00
modified: 2017-07-04T12:00:00+00:00
is object of: weightliftingtype

snooker
type: Concept
definition: Two players using a cue and a white ball to *sink* other coloured balls in a correct order on a baize table and to cause an opponent to miss-hit by positioning the white ball in an inappropriate place.
in scheme: Value of a Sport Facet
created: 2017-07-04T12:00:00+00:00
modified: 2017-07-04T12:00:00+00:00
is object of: billiardtype

big-air (snowboarding)
type: Concept
definition: a competition involving a jump ramp and tricks performed in the air
in scheme: Value of a Sport Facet
created: 2019-11-22T12:00:00+00:00
modified: 2019-11-22T12:00:00+00:00
is object of: snowboardingtype

snowboard-cross
type: Concept
definition: a multi-participant downhill sbowboard race on irregular terrain
in scheme: Value of a Sport Facet
created: 2019-11-22T12:00:00+00:00
modified: 2019-11-22T12:00:00+00:00
is object of: snowboardingtype

halfpipe (snowboarding)
type: Concept
definition: a competition involving a semi-circular course with snowboarders performing tricks while going from side to side
in scheme: Value of a Sport Facet
created: 2019-11-22T12:00:00+00:00
modified: 2019-11-22T12:00:00+00:00
is object of: snowboardingtype

soling
type: Concept
definition: Boat Category: three man keel boat
in scheme: Value of a Sport Facet
created: 2017-07-04T12:00:00+00:00
modified: 2017-07-04T12:00:00+00:00
is object of: sailingtype

speedway
type: Concept
definition: Motorcycle race involving up to six riders competing over a flat oval track. Speedway motorcycles use only one gear and have no brakes.
in scheme: Value of a Sport Facet
created: 2017-07-04T12:00:00+00:00
modified: 2017-07-04T12:00:00+00:00
is object of: motorcyclingtype

sprint
type: Concept
definition: A race over a shorter distance than is traditional and that focuses on speed.
in scheme: Value of a Sport Facet
created: 2017-07-04T12:00:00+00:00
modified: 2017-07-04T12:00:00+00:00
is object of: racetype

staged
type: Concept
definition: A race divided into different parts based on time or distance.
in scheme: Value of a Sport Facet
created: 2017-07-04T12:00:00+00:00
modified: 2017-07-04T12:00:00+00:00
is object of: racetype

star
type: Concept
definition: Boat Category: two man keel boat (7.10m/sq mainsail) Olympic sport
in scheme: Value of a Sport Facet
created: 2017-07-04T12:00:00+00:00
modified: 2017-07-04T12:00:00+00:00
is object of: sailingtype

steeplechase
type: Concept
definition: A mounted horse race over at least eight classic obstacles, four of which must be different, such as the water jump, spruce fences, mud walls etc.
in scheme: Value of a Sport Facet
created: 2017-07-04T12:00:00+00:00
modified: 2019-07-23T12:00:00+00:00
is object of: horseracingtype

street
type: Concept
definition: BMX that makes use of urban and public spaces to perform tricks.
in scheme: Value of a Sport Facet
created: 2017-07-04T12:00:00+00:00
modified: 2017-07-04T12:00:00+00:00
is object of: bmxfreestyletype

supercross
type: Concept
definition: Racing specialized high performance off-road motorcycles on artificially made dirt tracks consisting of steep jumps and obstacles
in scheme: Value of a Sport Facet
created: 2017-07-04T12:00:00+00:00
modified: 2017-07-04T12:00:00+00:00
is object of: motorcyclingtype

super-G
type: Concept
definition: Alpine skiing speed race between widly set gates.
in scheme: Value of a Sport Facet
created: 2017-07-04T12:00:00+00:00
modified: 2017-07-04T12:00:00+00:00
is object of: alpineskiingtype

team sprint
type: Concept
definition: Track cycling event. The men's event involves a three-man team time trial held over three laps in a velodrome. The women's event involves a two-woman event held over two laps.
in scheme: Value of a Sport Facet
created: 2017-07-04T12:00:00+00:00
modified: 2017-07-04T12:00:00+00:00
is object of: cyclingtype

team sprint
type: Concept
definition: Skiing competition where two skiers do three laps each alternating around a short ski course. There are qualification rounds that lead to a final.
note: Moved from *nordicskiingtype* to *crosscountryskiingtype* in August 2019
in scheme: Value of a Sport Facet
created: 2017-07-04T12:00:00+00:00
modified: 2017-07-04T12:00:00+00:00
is object of: crosscountryskiingtype

time trial
type: Concept
definition: Race in a fixed distance against the clock.
in scheme: Value of a Sport Facet
created: 2017-07-04T12:00:00+00:00
modified: 2017-07-04T12:00:00+00:00
is object of: racetype

tornado
type: Concept
definition: Boat Category: two man catamaran (21m/sq mainsail) Olympic sport
in scheme: Value of a Sport Facet
created: 2017-07-04T12:00:00+00:00
modified: 2017-07-04T12:00:00+00:00
is object of: sailingtype

track
type: Concept
definition: A bicycle racing sport usually held on specially built banked tracks or velodromes using track bicycles.
in scheme: Value of a Sport Facet
created: 2017-07-04T12:00:00+00:00
modified: 2017-07-04T12:00:00+00:00
is object of: cyclingtype

trap
type: Concept
definition: Shooting event with moving targets shot from a single machine, generally away from the shooter.
in scheme: Value of a Sport Facet
created: 2017-07-04T12:00:00+00:00
modified: 2017-07-04T12:00:00+00:00
is object of: shootingtype

TRC
type: Concept
definition: In the TRC (Throw Run Catch) sub event the player throws a disc and then runs to catch it as far away as possible with one hand before it hits the ground.
in scheme: Value of a Sport Facet
created: 2017-07-04T12:00:00+00:00
modified: 2017-07-04T12:00:00+00:00
is object of: flyingdisctype

trial
type: Concept
definition: A timed race in which competitors must negotiate tricky terrain and obstacles without putting their feet down.
in scheme: Value of a Sport Facet
created: 2017-07-04T12:00:00+00:00
modified: 2017-07-04T12:00:00+00:00
is object of: racetype

trick
type: Concept
definition: Skiers perform a maximum of figures in a limited time period
in scheme: Value of a Sport Facet
created: 2017-07-04T12:00:00+00:00
modified: 2017-07-04T12:00:00+00:00
is object of: waterskiingtype

trinquet
type: Concept
definition: A *Trinquet* is an indoor fronton with a 28.5 meters long court surrounded by four walls. The four walls are used in the game.
in scheme: Value of a Sport Facet
created: 2017-07-04T12:00:00+00:00
modified: 2017-07-04T12:00:00+00:00
is object of: jaialaitype

trotting
type: Concept
definition: Horses pitched to a jockeyed buggy race in a trot round a flat course.
in scheme: Value of a Sport Facet
created: 2017-07-04T12:00:00+00:00
modified: 2017-07-04T12:00:00+00:00
is object of: horseracingtype

ultimate
type: Concept
definition: Team game. Played outdoors on soccer-size field with 7 players per team and indoors with 5 players per team. Games are played to a preset number of goals. Goals are scored by passing the disc to a team-member catching it inside the goal area.
in scheme: Value of a Sport Facet
created: 2017-07-04T12:00:00+00:00
modified: 2017-07-04T12:00:00+00:00
is object of: flyingdisctype

uneven bars
type: Concept
definition: Artistic gymnastics event where gymnasts run through an airborne routine swinging around and between the uneven bars.
in scheme: Value of a Sport Facet
created: 2017-07-04T12:00:00+00:00
modified: 2017-07-04T12:00:00+00:00
is object of: artisticgymtype

vault
type: Concept
definition: Artistic gymnastics event where gymnasts propel themselves by jumping on a trampoline after running quickly down a 25m lane.
in scheme: Value of a Sport Facet
created: 2017-07-04T12:00:00+00:00
modified: 2017-07-04T12:00:00+00:00
is object of: artisticgymtype

vaulting
type: Concept
definition: Gymnastics and dance performed on horseback.
in scheme: Value of a Sport Facet
created: 2017-07-04T12:00:00+00:00
modified: 2017-07-04T12:00:00+00:00
is object of: equestriantype

vert ramp
type: Concept
definition: BMX competition held on a vert ramp which allows the competitors to fly into the air and land back on the ramp.
in scheme: Value of a Sport Facet
created: 2017-07-04T12:00:00+00:00
modified: 2017-07-04T12:00:00+00:00
is object of: bmxfreestyletype

vtt-cross
type: Concept
definition: An endurance race on mountain bikes around a 10km circuit over various terrain and with different degrees of slopes. Competitors are not allowed any exterior help.
in scheme: Value of a Sport Facet
created: 2017-07-04T12:00:00+00:00
modified: 2017-07-04T12:00:00+00:00
is object of: mountainbikingtype

vtt-downhill
type: Concept
definition: Individual mountain bike race against the clock staged on a downhill circuit featuring obstacles.
in scheme: Value of a Sport Facet
created: 2017-07-04T12:00:00+00:00
modified: 2017-07-04T12:00:00+00:00
is object of: mountainbikingtype

women
type: Concept
definition: Single female human person
in scheme: Value of a Sport Facet
created: 2017-07-04T12:00:00+00:00
modified: 2017-07-04T12:00:00+00:00
is object of: gender

xare
type: Concept
definition: The *xare*, is the name of the game played in a trinquet by teams of 2 players. The players use a *xare* (or the Argentina bat) 55 cm long and 16 cm wide.
in scheme: Value of a Sport Facet
created: 2017-07-04T12:00:00+00:00
modified: 2017-07-04T12:00:00+00:00
is object of: jaialaitype

yngling
type: Concept
definition: Olympic boat class. A race around different courses in a boat of 6.35 metres (20ft 10in) long and 1.73 metres (5ft 8in) wide, crewed in Olympic competition only by women. The number of races and the length of the courses varies.
in scheme: Value of a Sport Facet
created: 2017-07-04T12:00:00+00:00
modified: 2017-07-04T12:00:00+00:00
is object of: sailingtype