MTA
type: Concept
definition: In the MTA (Maximum Time Aloft) sub event the player throws a disc and then tries to catch the disc with one hand as late as possible before it hits the ground.
in scheme: asportfacetvalue
created: 2017-07-04T12:00:00+00:00
modified: 2017-07-04T12:00:00+00:00
is object of: flyingdisctype