TRC
type: Concept
definition: In the TRC (Throw Run Catch) sub event the player throws a disc and then runs to catch it as far away as possible with one hand before it hits the ground.
in scheme: asportfacetvalue
created: 2017-07-04T12:00:00+00:00
modified: 2017-07-04T12:00:00+00:00
is object of: flyingdisctype