beach football
type: Concept
definition: A form of association football played on a soft-sand surface and a smaller pitch which allows for numerous goal attempts
in scheme: asportfacetvalue
created: 2019-11-25T12:00:00+00:00
modified: 2019-11-25T12:00:00+00:00
is object of: soccertype