big-air (snowboarding)
type: Concept
definition: a competition involving a jump ramp and tricks performed in the air
in scheme: asportfacetvalue
created: 2019-11-22T12:00:00+00:00
modified: 2019-11-22T12:00:00+00:00
is object of: snowboardingtype