endurance
type: Concept
definition: Equestrian sport consisting of controlled long-distance races.
in scheme: asportfacetvalue
created: 2017-07-04T12:00:00+00:00
modified: 2017-07-04T12:00:00+00:00
is object of: equestriantype