endurance
type: Concept
definition: Motorcycle road race where consistency and endurance is the object.
in scheme: asportfacetvalue
created: 2017-07-04T12:00:00+00:00
modified: 2017-07-04T12:00:00+00:00
is object of: motorcyclingtype