halfpipe (snowboarding)
type: Concept
definition: a competition involving a semi-circular course with snowboarders performing tricks while going from side to side
in scheme: asportfacetvalue
created: 2019-11-22T12:00:00+00:00
modified: 2019-11-22T12:00:00+00:00
is object of: snowboardingtype