hoop
type: Concept
definition: Rhythmic gymnastics event where a hoop is rolled and thrown
in scheme: asportfacetvalue
created: 2017-07-04T12:00:00+00:00
modified: 2017-07-04T12:00:00+00:00
is object of: rhythmgymtype