oval track
type: Concept
definition: Dog race where dogs pursue an artificial rabbit around an oval track .
in scheme: asportfacetvalue
created: 2017-07-04T12:00:00+00:00
modified: 2017-07-04T12:00:00+00:00
is object of: dogracingtype