pursuit
type: Concept
definition: A race where the competitors start in relation to some previous result. Best competitor start first and then the rest in pursuit at some interval later.
in scheme: asportfacetvalue
created: 2017-07-04T12:00:00+00:00
modified: 2017-07-04T12:00:00+00:00
is object of: racetype