side-cars
type: Concept
definition: Race using motorycles of different engine sizes with an attached side car featuring a passenger.
in scheme: asportfacetvalue
created: 2017-07-04T12:00:00+00:00
modified: 2017-07-04T12:00:00+00:00
is object of: motorcyclingtype