Authority Status
type: ConceptScheme
pref scheme alias: authoritystatus
authority: http://www.iptc.org
rights holder: IPTC, International Press Telecommunications Council - https://iptc.org
licence link: http://creativecommons.org/licenses/by/4.0/
date released: 2023-05-17T12:00:00+00:00
definition: Describes the status of the authority managing a resource such as a scheme or a catalog.
has top concept: No current authority
has top concept: No single authority
has top concept: Country-specific authority

No current authority
type: Concept
definition: The values in this resource have no current authority. For example, they were managed by an entity that no longer exists.
in scheme: Authority Status
created: 2023-05-17T12:00:00+00:00
modified: 2023-05-17T12:00:00+00:00

No single authority
type: Concept
definition: No single authority manages the values in this resource.
in scheme: Authority Status
created: 2023-05-17T12:00:00+00:00
modified: 2023-05-17T12:00:00+00:00

Country-specific authority
type: Concept
definition: The values in this resource are managed on a per-country basis.
in scheme: Authority Status
created: 2023-05-17T12:00:00+00:00
modified: 2023-05-17T12:00:00+00:00