Camera Operator
type: Concept
definition: A party (person, organisation or system) who operates the camera that records the content of the item
in scheme: contentprodpartyrole
created: 2018-04-04T12:00:00+00:00
modified: 2018-04-04T12:00:00+00:00