Generative AI Prompt Writer
type: Concept
definition: A party (person, organisation, or system) that wrote or edited the prompt entered into a generative AI system
in scheme: contentprodpartyrole
created: 2024-03-28T12:00:00+00:00
modified: 2024-03-28T12:00:00+00:00