Metadata Editor
type: Concept
definition: A party (person, organisation or system) that edited the metadata of the item
in scheme: contentprodpartyrole
created: 2023-09-29T12:00:00+00:00
modified: 2023-09-29T12:00:00+00:00