Fantasy Violence
type: Concept
definition: The content contains violent actions of a fantasy nature, involving human or non-human characters in situations easily distinguishable from real life
in scheme: contentwarning
created: 2023-03-30T12:00:00+00:00
modified: 2023-03-30T12:00:00+00:00