Advisory
type: Concept
definition: Recommendation on editorial or technical matters by a provider to its customers
in scheme: genre
created: 2012-10-04T12:00:00+00:00
modified: 2012-10-04T12:00:00+00:00