Fact Check
type: Concept
definition: The news item looks into the truth or falsehood of another reported news item or assertion (for example a statement on social media by a public figure)
in scheme: genre
created: 2020-04-02T12:00:00+00:00
modified: 2020-04-07T12:00:00+00:00