User Generated Content
type: Concept
definition: Content providing firsthand evidence regarding an event that is captured by non-journalists who are witnesses of or participants in the event
in scheme: genre
created: 2024-02-13T12:00:00+00:00
modified: 2024-02-13T12:00:00+00:00