Associated stream
type: Concept
definition: The related resource contains streaming data associated with this Item
in scheme: itemrelation
created: 2014-01-17T12:00:00+00:00
modified: 2020-06-05T12:00:00+00:00