folk og fe
type: Concept
definition: Fortellinger om mennesker dyr og annet, gjerne med fokus på følelsesmessige aspekter.
in scheme: mediatopic
created: 2009-10-22T02:00:00+00:00
modified: 2021-05-05T12:00:00+00:00