labour
type: Concept
preferred label: Arbeit, Soziales @de
preferred label: Social @fr
preferred label: Arbete @se
preferred label: عمل @ar
preferred label: Mano de obra @es
preferred label: trabalho @pt-pt
preferred label: arbejde @dk
preferred label: 劳动 @zh-hans
preferred label: arbeidsliv @no-nb
preferred label: labor
definition: Sociala aspekter, organisationer, regler och förhållanden kring mänskliga ansträngningar för att generera inkomst, eller förse med service, samt ekonomisk ersättning till arbetslösa. Fackliga frågor, arbetslagstiftning, pensioner, arbetslöshet mm. @se
definition: Soziale Aspekte, Organisationen, Regeln und Bedingungen bezogen auf die bezahlte Arbeit von menschlicher Leistung, für eine Generation des Wohlstands oder Belohnung für Dienstleistungen und die wirtschaftliche Unterstützung bei Arbeitslosigkeit @de
definition: Social aspects, organisations, rules and conditions affecting the employment of human effort for the generation of wealth or provision of services and the economic support of the unemployed.
definition: Aspetos sociais, organizações, regras e condições que afetam o emprego e a produção de riqueza ou o fornecimento de serviços. Apoio económico aos desempregados. @pt-pt
definition: Aspectos sociais, organizações, regras e condições que afetam o emprego e a geração de riqueza ou o fornecimento de serviços. Apoio econômico aos desempregados. @pt-br
definition: Sociale aspekter, organisationer, regler og betingelser på arbejdsmarkedet. @dk
definition: 影响创造财富或提供服务的人力使用的社会因素、组织、规则和条件，以及提供失业者的经济支持 @zh-hans
definition: Social aspects, organizations, rules and conditions affecting the employment of human effort for the generation of wealth or provision of services and the economic support of the unemployed.
in scheme: mediatopic
created: 2009-10-22T02:00:00+00:00
modified: 2021-02-18T12:00:00+00:00
narrower: http://cv.iptc.org/newscodes/mediatopic/20000509
narrower: http://cv.iptc.org/newscodes/mediatopic/20000521
narrower: http://cv.iptc.org/newscodes/mediatopic/20000523
narrower: http://cv.iptc.org/newscodes/mediatopic/20000524
narrower: http://cv.iptc.org/newscodes/mediatopic/20000531
narrower: http://cv.iptc.org/newscodes/mediatopic/20000533
narrower: http://cv.iptc.org/newscodes/mediatopic/20000536