Wissenschaft, Technik, Forschung
type: Concept
definition: Alle Aspekte des menschlichen Verständnisses sowie der methodischen Erforschung der Natur-, Form- und Sozialwissenschaften, wie Astronomie, Linguistik oder Ökonomie
in scheme: mediatopic
created: 2009-10-22T02:00:00+00:00
modified: 2021-02-18T12:00:00+00:00