Ciencia y tecnología
type: Concept
definition: Todos los campos relacionados con la comprensión humana, así como el estudio metódico y la investigación de las ciencias naturales, formales y sociales, como la astronomía, la lingüística o la economía
in scheme: mediatopic
created: 2009-10-22T02:00:00+00:00
modified: 2021-02-18T12:00:00+00:00