Science et technologie
type: Concept
definition: Tous les domaines relatifs à la compréhension humaine, ainsi qu'à l'étude méthodique et à la recherche des sciences naturelles, formelles et sociales, telles que l'astronomie, la linguistique ou l'économie
in scheme: mediatopic
created: 2009-10-22T02:00:00+00:00
modified: 2021-02-18T12:00:00+00:00