Conflit, guerre et paix
type: Concept
definition: Actes de violence dont les motifs peuvent être sociaux ou politiques, activités militaires, conflits géopolitiques, efforts de résolution de conflit
in scheme: mediatopic
created: 2009-10-22T02:00:00+00:00
modified: 2021-02-18T12:00:00+00:00
broad match: http://cv.iptc.org/newscodes/subjectcode/16000000