Krise, Krieg, Konflikte
type: Concept
preferred label: Conflicto, guerra y paz @es
preferred label: Krig, konflikter och oroligheter @se
preferred label: نزاعات، حرب وسلام @ar
preferred label: Conflit, guerre et paix @fr
preferred label: conflict, war and peace @en-gb
preferred label: conflito, guerra e paz @pt-pt
preferred label: konflikt, krig og fred @dk
preferred label: 冲突、战争与和平 @zh-hans
definition: Actos de protesta o de violencia cuyos motivos pueden ser sociales o políticos, actividades militares, conflictos geopolíticos, esfuerzos de resolución de conflictos @es
definition: Acts of socially or politically motivated protest or violence, military activities, geopolitical conflicts, as well as resolution efforts @en-gb
definition: Sozial oder politisch motivierte Aktivitäten sowhl in Form von Protesten, Gewalttätigkeiten, Militäraktionen und geopolitischen Konflikten, als auch Aktivitäten zur Lösung dessen
definition: Actes de violence dont les motifs peuvent être sociaux ou politiques, activités militaires, conflits géopolitiques, efforts de résolution de conflit @fr
definition: Socialt eller politiskt motiverade protester och/eller våldshandlingar. Terrorism, väpnade konflikter, social oro, statskupper, Gerillaaktiviteter, massakrer, upplopp, våldsamma demonstrationer, krig. @se
definition: Atos de protesto ou de violência, cujos motivos podem ser sociais ou políticos, atividades militares, conflitos geopolíticos, esforços de resolução de conflitos. @pt-pt
definition: Socialt eller politisk motiverede protester og/eller voldshandlinger. Terrorisme, væbnede konflikter, social uro, statskup, guerillaaktiviteter, massakrer, optøjer, voldelige demonstrationer og krig, såvel som fredsinitiativer. @dk
definition: 具有社会或政治动机的示威或暴力行为、军事活动、地缘政治冲突以及试图解决问题的努力 @zh-hans
in scheme: mediatopic
created: 2009-10-22T02:00:00+00:00
modified: 2021-02-18T12:00:00+00:00
narrower: http://cv.iptc.org/newscodes/mediatopic/20000053
narrower: http://cv.iptc.org/newscodes/mediatopic/20000056
narrower: http://cv.iptc.org/newscodes/mediatopic/20000065
narrower: http://cv.iptc.org/newscodes/mediatopic/20000070
narrower: http://cv.iptc.org/newscodes/mediatopic/20000071
narrower: http://cv.iptc.org/newscodes/mediatopic/20000073
narrower: http://cv.iptc.org/newscodes/mediatopic/20000077
narrower: http://cv.iptc.org/newscodes/mediatopic/20001361
narrower: http://cv.iptc.org/newscodes/mediatopic/20001377
broad match: http://cv.iptc.org/newscodes/subjectcode/16000000