冲突、战争与和平
type: Concept
definition: 具有社会或政治动机的示威或暴力行为、军事活动、地缘政治冲突以及试图解决问题的努力
in scheme: mediatopic
created: 2009-10-22T02:00:00+00:00
modified: 2021-02-18T12:00:00+00:00
broad match: http://cv.iptc.org/newscodes/subjectcode/16000000