arts and entertainment
type: Concept
preferred label: Kunst und Unterhaltung @de
preferred label: Konst och underhållning @se
preferred label: فنون وتسلية @ar
preferred label: Arte y entretenimiento @es
preferred label: Arts et divertissement @fr
preferred label: arte e entretenimento @pt-pt
preferred label: kunst og underholdning @dk
preferred label: 艺术与娱乐 @zh-hans
preferred label: kunst og underhaldning @no-nn
definition: All forms of arts and entertainment
definition: Todas las formas de arte y de entretenimiento @es
definition: Alla former av konst och underhållning som inte hör till nöje. @se
definition: Alle Formen von Kunst und Unterhaltung @de
definition: Toutes les formes d'arts et de divertissement @fr
definition: Todas as formas de arte e entretenimento. @pt-pt
definition: Alle former for kunst og underholdning. @dk
definition: 各种形式的艺术和娱乐 @zh-hans
definition: Alle former for kunst og underhaldning. @no-nn
in scheme: mediatopic
created: 2009-10-22T02:00:00+00:00
modified: 2021-02-18T12:00:00+00:00
broad match: http://cv.iptc.org/newscodes/subjectcode/01000000
broader: http://cv.iptc.org/newscodes/mediatopic/01000000
narrower: http://cv.iptc.org/newscodes/mediatopic/20000003
narrower: http://cv.iptc.org/newscodes/mediatopic/20000004
narrower: http://cv.iptc.org/newscodes/mediatopic/20000005
narrower: http://cv.iptc.org/newscodes/mediatopic/20000007
narrower: http://cv.iptc.org/newscodes/mediatopic/20000011
narrower: http://cv.iptc.org/newscodes/mediatopic/20000013
narrower: http://cv.iptc.org/newscodes/mediatopic/20000018
narrower: http://cv.iptc.org/newscodes/mediatopic/20000029
narrower: http://cv.iptc.org/newscodes/mediatopic/20000031
narrower: http://cv.iptc.org/newscodes/mediatopic/20001179
narrower: http://cv.iptc.org/newscodes/mediatopic/20001181