Ballett
type: Concept
preferred label: ballet @en-gb
preferred label: باليه @ar
preferred label: Ballet @es
preferred label: Danse classique @fr
preferred label: Balett @se
preferred label: 芭蕾舞 @zh-hans
preferred label: ballett @no-nb
definition: Klassisk dansstil med steg, positioner och gester. @se
definition: A classical dance form based on formal gestures, steps and postures @en-gb
definition: Eine klassische Tanzform auf der Grundlage vorgegebener Bewegungen, Schrittfolgen und Körperhaltungen
definition: Uma forma de dança clássica, baseada em gestos, passos e posturas formais. @pt-pt
definition: Klassisk dansestil med trin, positioner og bevægelser. @dk
definition: 一种基于特定动作程式、舞步和姿势的古典舞蹈形式 @zh-hans
in scheme: mediatopic
created: 2009-10-22T02:00:00+00:00
modified: 2021-02-18T12:00:00+00:00
broad match: http://cv.iptc.org/newscodes/subjectcode/01006000
broader: http://cv.iptc.org/newscodes/mediatopic/20000007