Danza tradicional
type: Concept
definition: Estilo de baile que refleja la vida y la cultura de un grupo específico de personas o región, como el baile folclórico y ceremonial
in scheme: mediatopic
created: 2009-10-22T02:00:00+00:00
modified: 2021-02-18T12:00:00+00:00
broad match: http://cv.iptc.org/newscodes/subjectcode/01006000
broader: http://cv.iptc.org/newscodes/mediatopic/20000007