Mode
type: Concept
definition: Styles et tendances dans les vêtements, les chaussures, les accessoires, y compris la conception, la présentation et le port de ces styles et tendances
in scheme: mediatopic
created: 2009-10-22T02:00:00+00:00
modified: 2021-02-18T12:00:00+00:00
broader: http://cv.iptc.org/newscodes/mediatopic/20000002