poetry
type: Concept
preferred label: شعر @ar
preferred label: Poesía @es
preferred label: Poésie @fr
preferred label: Poesie @de
preferred label: Poesi @se
preferred label: poesia @pt-pt
preferred label: poesi @dk
preferred label: 诗歌 @zh-hans
preferred label: lyrikk @no-nb
definition: Written works that use the aesthetic and rhythmic qualities of language to express a message or emotion
definition: Œuvre écrite utilisant les qualités esthétiques et rythmiques du langage pour exprimer un message ou une émotion @fr
definition: Schriftliche Werke, die auf die Ästhetik und die Rythmik von Sprache bauen um eine Botschaft oder Gefühle auszudrücken @de
definition: Obra escrita que utiliza las calidades estéticas y rítmicas del lenguaje para expresar un mensaje o una emoción @es
definition: Skrivna texter som förutom innehåll även förmedlar en känsla via formatet, som kan följa ett visst versmått eller vara fritt. @se
definition: Obras escritas que usam as qualidades estéticas e rítmicas da língua para expressar emoções ou uma mensagem. @pt-pt
definition: Skriftlige værker, der bruger sprogets æstetiske og rytmiske egenskaber til at udtrykke et budskab eller en følelse. @dk
definition: 通过语言美感和韵律表达情感的文字作品 @zh-hans
definition: Written works that use the esthetic and rhythmic qualities of language to express a message or emotion
in scheme: mediatopic
created: 2009-10-22T02:00:00+00:00
modified: 2021-02-18T12:00:00+00:00
broader: http://cv.iptc.org/newscodes/mediatopic/20000013