musical performance
type: Concept
preferred label: حفل موسيقي @ar
preferred label: Concierto @es
preferred label: Concert @fr
preferred label: Musikaufführung @de
preferred label: Musikframträdande @se
preferred label: concerto @pt-pt
preferred label: musikalsk optræden @dk
preferred label: 音乐表演 @zh-hans
preferred label: konsert @no-nb
definition: Framföra sång och/eller musik inför publik. @se
definition: Représentation musicale exécutée par des musiciens (instrumentistes ou chanteurs) devant un public @fr
definition: Musiker die vor einem Publikum spielen um dieses zu unterhalten @de
definition: Actuación musical en la que músicos o cantantes actúan ante un público con fines de entretenimiento @es
definition: Musicians performing for an audience for the purpose of entertainment
definition: Atuação musical em que os músicos ou cantores atuam perante um público para entretenimento. @pt-pt
definition: Musiker, der fremfører sang og/eller musik for publikum. @dk
definition: 以娱乐为目的的音乐演奏表演 @zh-hans
in scheme: mediatopic
created: 2009-10-22T02:00:00+00:00
modified: 2021-02-18T12:00:00+00:00
broad match: http://cv.iptc.org/newscodes/subjectcode/01011000
broader: http://cv.iptc.org/newscodes/mediatopic/20000018