Klassik
type: Concept
preferred label: Classique @fr
preferred label: classical music @en-gb
preferred label: Klassisk musik @se
preferred label: موسيقى كلاسيكية @ar
preferred label: Música clásica @es
preferred label: música clássica @pt-pt
preferred label: klassisk musik @dk
preferred label: 古典音乐 @zh-hans
preferred label: klassisk musikk @no-nb
definition: Eine Gattung von Musik, die auf Traditionen westlicher Musik basiert und sowohl religiöse als auch weltliche Musik umfasst, zum Beispiel Symphonien, Konzerte oder Sonaten
definition: A genre of music rooted in the traditions of Western music, including both religious and secular music, such as symphony, concerto and sonata. @en-gb
definition: Género musical arraigado en las tradiciones de la música occidental, que incluye música religiosa y secular, como la sinfonía, el concierto y la sonata @es
definition: Genre musical de tradition occidentale, comprenant la musique religieuse et profane, comme la symphonie, le concerto et la sonate @fr
definition: Musik som följer klassiska metoder och uttryck när det gäller harmonier och rytmer. @se
definition: Música que segue estruturas clássicas de ritmo e harmonia. @pt-pt
definition: Musik, der følger klassiske metoder og udtryk med hensyn til harmonier og rytmer. @dk
definition: 一种植根于西方音乐传统的音乐类型，包括宗教和世俗音乐，如交响乐、协奏曲和奏鸣曲 @zh-hans
in scheme: mediatopic
created: 2009-10-22T02:00:00+00:00
modified: 2021-02-18T12:00:00+00:00
broader: http://cv.iptc.org/newscodes/mediatopic/20000021