Música country
type: Concept
definition: Género de música que se originó en el sur de los Estados Unidos, a menudo compuesto por baladas o melodías de baile y con instrumentos de cuerda como banjos, violines y guitarras
in scheme: mediatopic
created: 2009-10-22T02:00:00+00:00
modified: 2021-02-18T12:00:00+00:00
broader: http://cv.iptc.org/newscodes/mediatopic/20000021