música country
type: Concept
preferred label: Música country @es
preferred label: موسيقى الكانتري @ar
preferred label: Country @se
preferred label: country music @en-gb
preferred label: countrymusik @dk
preferred label: 乡村音乐 @zh-hans
preferred label: countrymusikk @no-nb
definition: Eine Gattung von Musik, die aus den südlichen USA stammt, meisten in Form von Balladen oder Tanzmusik unter Verwendung von Instrumenten wie Banjos, Geigen und Gitarren. @de
definition: En musikstil med rötter i södra USA, ofta bestående av ballader eller dansmelodier och spelade på stränginstrument. @se
definition: Genre musical originaire du sud des États-Unis, souvent composé de ballades ou d'airs de danse et comportant des instruments à cordes tels que des banjos, des violons et des guitares @fr
definition: Género de música que se originó en el sur de los Estados Unidos, a menudo compuesto por baladas o melodías de baile y con instrumentos de cuerda como banjos, violines y guitarras @es
definition: A genre of music that originated in the southern United States, often consisting of ballads or dance tunes and featuring string instruments such as banjos, fiddles and guitars @en-gb
definition: Género de música com origem no Sul dos Estados Unidos, que consiste frequentemente em baladas ou músicas dançáveis e que usa instrumentos de corda, como os banjos ou as guitarras.
definition: Gênero de música com origem no Sul dos Estados Unidos, que consiste frequentemente em baladas ou músicas dançáveis e que usa instrumentos de corda, como os banjos ou as guitarras.
definition: En genre af musik, der stammer fra det sydlige USA, ofte bestående af ballader eller dansemelodier og med strengeinstrumenter som banjoer, violiner og guitarer. @dk
definition: 一种起源于美国南部的音乐类型，通常由民谣或舞曲组成，以弦乐为主，比如五弦琴、小提琴和吉他 @zh-hans
in scheme: mediatopic
created: 2009-10-22T02:00:00+00:00
modified: 2021-02-18T12:00:00+00:00
broader: http://cv.iptc.org/newscodes/mediatopic/20000021