乡村音乐
type: Concept
definition: 一种起源于美国南部的音乐类型，通常由民谣或舞曲组成，以弦乐为主，比如五弦琴、小提琴和吉他
in scheme: mediatopic
created: 2009-10-22T02:00:00+00:00
modified: 2021-02-18T12:00:00+00:00
broader: http://cv.iptc.org/newscodes/mediatopic/20000021