música popular
type: Concept
preferred label: موسيقى شعبية @ar
preferred label: Pop @se
preferred label: popular music @en-gb
preferred label: Música popular @es
preferred label: popmusik @dk
preferred label: 流行音乐 @zh-hans
preferred label: pop/populærmusikk @no-nb
definition: Musikstil som är allmänt tillgänglig och komponerad för att locka många lyssnare. @se
definition: Genre musical largement accessible et conçu pour plaire à tous @fr
definition: Eine Gattung von Musik, die von vielen Gruppen in der Bevölkerung gehört wird und darauf abzielt, möglichst viele anzusprechen @de
definition: A genre of music that is widely accessible and designed to appeal to all @en-gb
definition: Género de música ampliamente accesible y diseñado para atraer a todos @es
definition: Género de música amplamente acessível e criada para agradar a toda a gente.
definition: Gênero de música amplamente acessível e criada para agradar a toda a gente.
definition: Musikstil, der er bredt tilgængelig og komponeret for at tiltrække mange lyttere. @dk
definition: 一种广受欢迎的音乐类型，旨在吸引所有人 @zh-hans
in scheme: mediatopic
created: 2009-10-22T02:00:00+00:00
modified: 2021-02-18T12:00:00+00:00
broader: http://cv.iptc.org/newscodes/mediatopic/20000021