Rock
type: Concept
definition: Genre musical originaire des États-Unis à la fin des années 1940 et au début des années 1950 évoluant à partir de styles musicaux afro-américains tels que le gospel, le jump blues, le jazz, le boogie woogie et le rhythm and blues
in scheme: mediatopic
created: 2009-10-22T02:00:00+00:00
modified: 2021-02-18T12:00:00+00:00
broader: http://cv.iptc.org/newscodes/mediatopic/20000021