摇滚乐
type: Concept
definition: 起源于20世纪40年代末50年代初美国的一种音乐流派，由福音乐、跳蓝调、爵士乐、布吉伍吉舞和节奏布鲁斯等非裔美国人的音乐风格演变而来
in scheme: mediatopic
created: 2009-10-22T02:00:00+00:00
modified: 2021-02-18T12:00:00+00:00
broader: http://cv.iptc.org/newscodes/mediatopic/20000021