opera
type: Concept
preferred label: Oper @de
preferred label: اوبرا @ar
preferred label: Opéra @fr
preferred label: Opera @se
preferred label: Ópera @es
preferred label: ópera @pt-pt
preferred label: 歌剧 @zh-hans
definition: Framförande av musikaliska verk, ofta dramatiska, av klassiskt skolade sångare och musiker. @se
definition: A form of performing art where classically trained musicians and singers perform a musical and dramatic work
definition: Eine Form der darstellenden Kunst bei der Musiker und Sänger mit Ausbildung in klassischer Musik ein vertontes dramaturgisches Werk aufführen @de
definition: Art du spectacle où des chanteurs et des musiciens de formation classique interprètent une œuvre musicale et théâtrale @fr
definition: Obra musical y teatral intepretada por músicos y cantantes de formación clásica @es
definition: Forma de arte performativa em que músicos e cantores clássicos representam obras dramáticas e musicais. @pt-pt
definition: Udførelse af musikværker, ofte dramatiske, af klassisk trænede sangere og musikere. @dk
definition: 一种表演艺术，由受过古典训练的音乐家和歌手表演音乐和戏剧作品 @zh-hans
change note: Changes: 2018-04-09 other Broader Term
in scheme: mediatopic
created: 2009-10-22T02:00:00+00:00
modified: 2021-09-30T12:00:00+00:00
broad match: http://cv.iptc.org/newscodes/subjectcode/01017001
broader: http://cv.iptc.org/newscodes/mediatopic/20000029