Musiktheater
type: Concept
definition: Ein Form der darstellenden Kunst, bei der Künstler eine Erzählung vor dem Publikum durch Lieder, Dialog und Aktivitäten vermitteln, wie etwa in Musicals und Operetten
in scheme: mediatopic
created: 2009-10-22T02:00:00+00:00
modified: 2021-09-30T12:00:00+00:00
retired: 2021-09-30T12:00:00+00:00
broader: http://cv.iptc.org/newscodes/mediatopic/20000029