music theatre
type: Concept
preferred label: Musiktheater @de
preferred label: مسرح غنائي @ar
preferred label: Théâtre musical @fr
preferred label: Musikteater @se
preferred label: Teatro musical @es
preferred label: teatro musical @pt-pt
preferred label: musikteater @dk
preferred label: 音乐剧 @zh-hans
preferred label: musikal @no-nb
preferred label: music theater
definition: Ein Form der darstellenden Kunst, bei der Künstler eine Erzählung vor dem Publikum durch Lieder, Dialog und Aktivitäten vermitteln, wie etwa in Musicals und Operetten @de
definition: Uttryck av känslor eller överförande av budskap via en historia som framförs genom dialog, musik eller fysiska uttryck, såsom musikaler och operetter. @se
definition: Forma de arte escénico donde los artistas interpretan una obra frente a un público a través de canciones, diálogos y acciones, como musicales y operetas @es
definition: A form of performing art where live performers portray a narrative to an audience through song, dialogue and action, such as musicals and operettas
definition: Art du spectacle où les artistes interpètent une œuvre sur scène devant un public à travers la chanson, la danse, le dialogue et l'action @fr
definition: Representação de uma história através de canções, diálogo e ação, como a ópera, a opereta, as revistas musicais, os music halls. @pt-pt
definition: En kunstform, der udtrykker følelser og budskaber gennem en historie formidlet via dialog, musik og handlinger, såsom musicals og operetter. @dk
definition: 一种表演艺术形式，表演者在现场通过歌曲、对白和动作向观众描绘一个故事，如轻歌剧等 @zh-hans
definition: A form of performing art where live performers portray a narrative to an audience through song, dialog and action, such as musicals and operettas
change note: Retired on 2021-09-30. Child terms moved up to be children of medtop:20000029 theatre.
in scheme: mediatopic
created: 2009-10-22T02:00:00+00:00
retired: 2021-09-30T12:00:00+00:00
modified: 2021-09-30T12:00:00+00:00
broader: http://cv.iptc.org/newscodes/mediatopic/20000029