design
type: Concept
definition: Disciplina artística que se foca na comunicação e apresentação visuais, e cujo produto final pode ir da joalharia ao design de interiores.
in scheme: mediatopic
created: 2009-10-22T02:00:00+00:00
modified: 2021-02-18T12:00:00+00:00
broader: http://cv.iptc.org/newscodes/mediatopic/20000031
broad match: http://cv.iptc.org/newscodes/subjectcode/01000000