design (visual arts)
type: Concept
preferred label: Diseño @es
preferred label: تصميم @ar
preferred label: Design @se
preferred label: Design (Bildende Kunst) @de
preferred label: design @pt-pt
preferred label: design (visuel kunst) @dk
preferred label: 设计（视觉艺术） @zh-hans
definition: Eine Kunstdisziplin, die sich auf visuelle Kommunikation und Präsentation konzentriert, die daraus hervorgehenden Produkte reichen von Schmuckstücken bis zur Wohnraumgestaltung @de
definition: Discipline artistique axée sur la communication visuelle et la présentation, dont le produit final peut aller de la joaillerie à la décoration intérieure @fr
definition: När man artistiskt bestämmer hur något ska se ut, kan vara så vitt skilda saker som smycken och interiörer. @se
definition: An artistic discipline which focuses on visual communication and presentation, the final product of which can range from jewellery to interior design
definition: Disciplina artística que se centra en la comunicación visual y la presentación, cuyo producto final puede variar desde joyas hasta diseño de interiores @es
definition: Disciplina artística que se foca na comunicação e apresentação visuais, e cujo produto final pode ir da joalharia ao design de interiores. @pt-pt
definition: Disciplina artística que se foca na comunicação e apresentação visuais, e cujo produto final pode ir da joalheria ao design de interiores. @pt-br
definition: En kunstnerisk disciplin, der fokuserer på visuel kommunikation og præsentation af et slutprodukt, kan spænde fra smykker til interiørdesign. @dk
definition: 一门注重视觉传达和展示的艺术学科，包括平面设计、珠宝首饰设计、室内设计等 @zh-hans
definition: An artistic discipline which focuses on visual communication and presentation, the final product of which can range from jewelry to interior design
in scheme: mediatopic
created: 2009-10-22T02:00:00+00:00
modified: 2021-02-18T12:00:00+00:00
broader: http://cv.iptc.org/newscodes/mediatopic/20000031
broad match: http://cv.iptc.org/newscodes/subjectcode/01000000