Zeichnen
type: Concept
preferred label: رسم @ar
preferred label: Dessin @fr
preferred label: drawing @en-gb
preferred label: Dibujo @es
preferred label: Teckning @se
preferred label: desenho @pt-pt
preferred label: tegning @dk
preferred label: 素描 @zh-hans
preferred label: tegnekunst @no-nb
preferred label: teiknekunst @no-nn
definition: Forma de arte visual que utiliza medios tales como lápices, rotuladores, pluma y tinta o carbón @es
definition: En form av visuell konst där pennor, kritor och liknande används. @se
definition: Ein Form der bildenden Künste die sich auf die Verwendung von Bleistiften, Filzstiften, Federn und Tinte sowie Holzkohle konzentriert
definition: A form of visual arts using mediums such as pencils, markers, pen and ink, charcoal @en-gb
definition: Forme d'art visuel réalisé avec des outils tels que crayons, marqueurs, plume et encre, fusain @fr
definition: Forma de arte visual que usa materiais como lápis, marcadores, caneta e tinta, carvão. @pt-pt
definition: En form for visuel kunst, hvor penne, farveblyanter og lignende bruges. @dk
definition: 一种使用铅笔、记号笔、钢笔和墨水、木炭等媒介创作的视觉艺术形式 @zh-hans
in scheme: mediatopic
created: 2009-10-22T02:00:00+00:00
modified: 2021-02-18T12:00:00+00:00
broad match: http://cv.iptc.org/newscodes/subjectcode/01000000
broader: http://cv.iptc.org/newscodes/mediatopic/20000031