Histoire de l'art
type: Concept
definition: Histoire du développement de l'art et de la culture comme l'évolution des peintures rupestres, les variations linguistiques dans le temps, l'évolution des valeurs socioculturelles
in scheme: mediatopic
created: 2009-10-22T02:00:00+00:00
modified: 2021-02-18T12:00:00+00:00
broader: http://cv.iptc.org/newscodes/mediatopic/20000038